{"text_format":"2","workbook":"xlsx","n_sheets":4,"sheets":["직접비기준","총연구비기준","간접비율 ","사업별연구비규모"],"not_rendered":{"charts":0,"images":0,"macros":0,"external_links":0,"defined_names":4,"comments":3,"pivot_tables":0},"unopened":[],"bounds":{"document_bytes":16777216,"sheet_cells":100000,"run_cost":"one","rows_first":2000,"rows_last":500,"rows_between":2000,"halvings":0,"cell_chars":16384,"cell_head_chars":4096},"cells_cut":0,"cells_raw":0,"read":"whole","date_system":"1900"}

{"sheet":"직접비기준","index":0,"n_rows":34,"n_cols":12,"rows_kept":34,"cut":false,"hidden":false,"merged":[[15,0,15,1],[1,0,1,11],[3,0,4,3],[3,4,4,6],[3,7,4,7],[6,0,6,1],[6,2,6,6],[27,0,27,1],[28,0,28,1],[29,1,29,2],[31,0,31,1],[0,0,0,11],[16,0,16,1],[17,0,17,1],[20,0,21,1],[22,0,23,0],[24,0,24,1],[25,0,26,0],[7,1,7,11],[9,0,9,1],[9,3,9,4],[9,5,9,11],[13,0,14,1]]}
["직접비 기준으로 산정(총연구비 기준으로 산정하시려면 총연구비기준 시트 이용)"]
["사용방법(노란색 셀만 입력하시면 자동 계산됩니다.)\n- 상반기 신청려는 사업을 선택합니다.\n- 소속기관명을 주의하여 입력합니다.(간접비 비율이 정상적으로 나오지 않는 경우 \"간접비율\" 시트의 기관명을 확인하시어 정확히 입력합니다.)\n- 연구기간을 검증 결과 \"통과\"로 나오도록 선택합니다(이공학개인기초는 6년 이상, 그외 사업은 5년 이하로 선택)\n- 인건비를 포함한 직접비를 입력합니다. 위탁연구과제가 있는 경우 위탁연구개발비를 입력합니다.\n   →5. 연구비의 오류메시지에 오류가 없는지 확인합니다.(오류가 있을 경우 연구비 하한, 상한을 확인하시고 수정합니다.\n☞ 입력이 완료되고 오류가 없는 경우 7. 신청가능사업을 보시고 신청하시려는 사업이 맞는지 확인하시기 바랍니다.\n※ 연구책임자 연구비 계산용으로 제공하는 파일로 제출하는 파일은 아님"]
[]
["1. 상반기 신청하시고자 하시는 사업 :",null,null,null,"중견연구",null,null,"→","하한연구비\n(천원)",{"$f":"IFERROR(VLOOKUP($E$4, 사업별연구비규모!$A$1:$C$3, 2, FALSE), \"\")","v":50000},"상한연구비\n(천원)",{"$f":"IFERROR(VLOOKUP($E$4, 사업별연구비규모!$A$1:$C$3, 3, FALSE), \"\")","v":300000}]
[{"$nulls":8},"연구기간하한\n(년)",{"$f":"IFERROR(VLOOKUP($E$4, 사업별연구비규모!$A$1:$E$3, 4, FALSE), \"\")","v":1},"연구기간상한\n(년)",{"$f":"IFERROR(VLOOKUP($E$4, 사업별연구비규모!$A$1:$E$3, 5, FALSE), \"\")","v":5}]
[]
["2. 소속기관명 :",null,"한국연구재단",{"$nulls":5},"간접비율 : ",{"$f":"IF(L7=1,VLOOKUP(C7,'간접비율 '!B:C,2,FALSE))/100","v":0.14960000000000001},"매칭기관수 : ",{"$f":"COUNTIF('간접비율 '!B:B, 직접비기준!C7)","v":1}]
["    - 검색결과 : ",{"$f":"\"소속기관명 검색결과 \" & IF(L7 = 1, \"간접비가 \" & TEXT($J$7, \"0.0#%\") & \"로 설정되었습니다.\", L7&\"개 기관이 검색되었습니다. 간접비율 시트에서 기관명을 확인하고 기재하시기 바랍니다.\")","v":"소속기관명 검색결과 간접비가 14.96%로 설정되었습니다."}]
[]
["3. 연구기간 :",null,5,"(연구기간 검증 결과 : ",null,{"$f":"IF(E4=\"\",\"사업 미선택\",IF(C10=\"\",\"연구기간 미선택\",IF(AND(INT(C10)>=INT(J5), INT(C10)<=INT(L5)), \"통과)\", IF(J5 = L5, E4&\"사업은 \" & J5 & \"년만 선택가능합니다)\", E4&\"사업은 \" & J5 & \"년 이상, \" & L5 & \"년 이하를 선택하셔야 합니다)\"))))","v":"통과)"}]
[]
["4. 인건비를 포함한 직접비(단위 : 천원)"]
["  * 위탁과제가 있는 경우만 위탁연구개발비를 기재(간접비 계상시 불포함)"]
["구분",null,{"$f":"IF(INT($C$10) >= (COLUMN(C14) - 2), (COLUMN(C14) - 2)&\"차년도\", \"\")","v":"1차년도"},{"$f":"IF(INT($C$10) >= (COLUMN(D14) - 2), (COLUMN(D14) - 2)&\"차년도\", \"\")","v":"2차년도"},{"$f":"IF(INT($C$10) >= (COLUMN(E14) - 2), (COLUMN(E14) - 2)&\"차년도\", \"\")","v":"3차년도"},{"$f":"IF(INT($C$10) >= (COLUMN(F14) - 2), (COLUMN(F14) - 2)&\"차년도\", \"\")","v":"4차년도"},{"$f":"IF(INT($C$10) >= (COLUMN(G14) - 2), (COLUMN(G14) - 2)&\"차년도\", \"\")","v":"5차년도"},{"$f":"IF(INT($C$10) >= (COLUMN(H14) - 2), (COLUMN(H14) - 2)&\"차년도\", \"\")","v":""},"","","",""]
[null,null,{"$f":"IF(INT($C$10) >= (COLUMN(C15) - 2), (COLUMN(C15) + 2014)&\"년\", \"\")","v":"2017년"},{"$f":"IF(INT($C$10) >= (COLUMN(D15) - 2), (COLUMN(D15) + 2014)&\"년\", \"\")","v":"2018년"},"2019년","2020년","2021년","","","","",""]
["직접비(인건비 포함)",null,43494,43494,43494,43494,43494]
["위탁연구개발비"]
["오류메시지 : ",null,{"$f":"IF(AND(C14=\"\",C16<>\"\"),\"기입금지\",\"\")","v":""},{"$f":"IF(AND(D14=\"\",D16<>\"\"),\"기입금지\",\"\")","v":""},"","","","","","","",""]
[]
["5. 연구비(단위 : 천원)"]
["구분",null,{"$f":"IF(INT($C$10) >= (COLUMN(C21) - 2), (COLUMN(C21) - 2)&\"차년도\", \"\")","v":"1차년도"},{"$f":"IF(INT($C$10) >= (COLUMN(D21) - 2), (COLUMN(D21) - 2)&\"차년도\", \"\")","v":"2차년도"},{"$f":"IF(INT($C$10) >= (COLUMN(E21) - 2), (COLUMN(E21) - 2)&\"차년도\", \"\")","v":"3차년도"},{"$f":"IF(INT($C$10) >= (COLUMN(F21) - 2), (COLUMN(F21) - 2)&\"차년도\", \"\")","v":"4차년도"},{"$f":"IF(INT($C$10) >= (COLUMN(G21) - 2), (COLUMN(G21) - 2)&\"차년도\", \"\")","v":"5차년도"},{"$f":"IF(INT($C$10) >= (COLUMN(H21) - 2), (COLUMN(H21) - 2)&\"차년도\", \"\")","v":""},"","","",""]
[null,null,{"$f":"IF(INT($C$10) >= (COLUMN(C22) - 2), (COLUMN(C22) + 2014)&\"년\", \"\")","v":"2017년"},{"$f":"IF(INT($C$10) >= (COLUMN(D22) - 2), (COLUMN(D22) + 2014)&\"년\", \"\")","v":"2018년"},"2019년","2020년","2021년","","","","",""]
["직접비","현금",{"$f":"IF(INT($C$10) >= (COLUMN(C23) - 2), C16, \"\")","v":43494},{"$f":"IF(INT($C$10) >= (COLUMN(D23) - 2), D16, \"\")","v":43494},43494,43494,43494,{"$f":"IF(INT($C$10) >= (COLUMN(H23) - 2), H16, \"\")","v":""},"","","",""]
[null,"현물"]
["위탁연구개발비",null,{"$f":"IF(INT($C$10) >= (COLUMN(C25) - 2), ROUNDDOWN(C17, 0), \"\")","v":0},0,0,0,0,"","","","",""]
["간접비","계산금액",{"$f":"IFERROR(ROUNDDOWN(C16/(1/$J$7), 0) - VALUE(RIGHT(\"S\"&(ROUNDDOWN(C16/(1/$J$7),0)+C16), 1)), \"\")","v":6506},{"$f":"IFERROR(ROUNDDOWN(D16/(1/$J$7), 0) - VALUE(RIGHT(\"S\"&(ROUNDDOWN(D16/(1/$J$7),0)+D16), 1)), \"\")","v":6506},6506,6506,6506,{"$f":"IFERROR(ROUNDDOWN(H16/(1/$J$7), 0) - VALUE(RIGHT(\"S\"&(ROUNDDOWN(H16/(1/$J$7),0)+H16), 1)), \"\")","v":0},0,0,0,0]
[null,"적용비율",{"$f":"IFERROR(C26/C23, \"\")","v":0.14958385064606614},{"$f":"IFERROR(D26/D23, \"\")","v":0.14958385064606614},0.14958385064606614,0.14958385064606614,0.14958385064606614,"","","","",""]
["연구비 총액",null,{"$f":"IF(INT($C$10)>=(COLUMN(C23)-2),SUM(C23:C26),\"\")","v":50000},{"$f":"IF(INT($C$10)>=(COLUMN(D23)-2),SUM(D23:D26),\"\")","v":50000},50000,50000,50000,"","","","",""]
["오류메시지 : ",null,{"$f":"IF(C28=\"\", \"\", IF(C28<$J$4,\"하한보다 작음\",IF(C28>$L$4,\"상한 초과\",\"\")))","v":""},{"$f":"IF(D28=\"\", \"\", IF(D28<$J$4,\"하한보다 작음\",IF(D28>$L$4,\"상한 초과\",\"\")))","v":""},"","","","","","","",""]
["6. 총연구비 :",{"$f":"SUM(C28:L28)","v":250000},null,"천원","유형 : ",{"$f":"IF(C10>5, IF(C10 < 9, \"유형1\", \"유형2\"), IF(B30<=150000, \"유형1\", IF(B30<=300000, \"유형2\", IF(B30<=500000, \"유형3\", \"유형4\"))))","v":"유형2"}]
[]
["7. 신청가능사업 :",null,{"$f":"IFERROR(IF(AND(B33=\"통과\", B34=\"통과\"), VLOOKUP(E4&F30, 사업별연구비규모!A8:B21, 2, FALSE) & \" 사업에 신청 가능\", \"연구기간 혹은 연구비에 오류가 있어 신청가능한 사업을 표기할 수 없음!\"), \"\")","v":"중견연구(1.5초과~3억이하) 사업에 신청 가능"}]
["  - 연구기간 : ",{"$f":"IF(F10=\"통과)\", \"통과\", \"3. 연구기간 검증 결과 메시지를 확인하세요!\")","v":"통과"}]
["  - 연구비 :",{"$f":"IF(AND(C29=\"\", D29=\"\", E29=\"\", F29=\"\", G29=\"\", H29=\"\", I29=\"\", J29=\"\", K29=\"\", L29=\"\"), \"통과\", \"5. 연구비 항목의 오류 메시지를 확인하세요\")","v":"통과"}]

{"sheet":"총연구비기준","index":1,"n_rows":34,"n_cols":12,"rows_kept":34,"cut":false,"hidden":false,"merged":[[27,0,27,1],[28,0,28,1],[29,1,29,2],[31,0,31,1],[16,0,16,1],[17,0,17,1],[20,0,21,1],[22,0,23,0],[24,0,24,1],[25,0,26,0],[0,0,0,11],[15,0,15,1],[1,0,1,11],[3,0,4,3],[3,4,4,6],[3,7,4,7],[6,0,6,1],[6,2,6,6],[7,1,7,11],[9,0,9,1],[9,3,9,4],[9,5,9,11],[13,0,14,1]]}
["총연구비 기준으로 산정(직접비 기준으로 산정하시려면 직접비기준 시트 이용)"]
["사용방법(노란색 셀만 입력하시면 자동 계산됩니다.)\n- 상반기 신청려는 사업을 선택합니다.\n- 소속기관명을 주의하여 입력합니다.(간접비 비율이 정상적으로 나오지 않는 경우 \"간접비율\" 시트의 기관명을 확인하시어 정확히 입력합니다.)\n- 연구기간을 검증 결과 \"통과\"로 나오도록 선택합니다(이공학개인기초는 6년 이상, 그외 사업은 5년 이하로 선택)\n- 인건비를 포함한 직접비를 입력합니다. 위탁연구과제가 있는 경우 위탁연구개발비를 입력합니다.\n   →5. 연구비의 오류메시지에 오류가 없는지 확인합니다.(오류가 있을 경우 연구비 하한, 상한을 확인하시고 수정합니다.\n☞ 입력이 완료되고 오류가 없는 경우 7. 신청가능사업을 보시고 신청하시려는 사업이 맞는지 확인하시기 바랍니다.\n※ 연구책임자 연구비 계산용으로 제공하는 파일로 제출하는 파일은 아님"]
[]
["1. 상반기 신청하시고자 하시는 사업 :",null,null,null,"신진연구",null,null,"→","하한연구비\n(천원)",{"$f":"IFERROR(VLOOKUP($E$4, 사업별연구비규모!$A$1:$C$3, 2, FALSE), \"\")","v":50000},"상한연구비\n(천원)",{"$f":"IFERROR(VLOOKUP($E$4, 사업별연구비규모!$A$1:$C$3, 3, FALSE), \"\")","v":100000}]
[{"$nulls":8},"연구기간하한\n(년)",{"$f":"IFERROR(VLOOKUP($E$4, 사업별연구비규모!$A$1:$E$3, 4, FALSE), \"\")","v":1},"연구기간상한\n(년)",{"$f":"IFERROR(VLOOKUP($E$4, 사업별연구비규모!$A$1:$E$3, 5, FALSE), \"\")","v":5}]
[]
["2. 소속기관명 :",null,"한국연구재단",{"$nulls":5},"간접비율 : ",{"$f":"IF(L7=1,VLOOKUP(C7,'간접비율 '!B:C,2,FALSE))/100","v":0.14960000000000001},"매칭기관수 : ",{"$f":"COUNTIF('간접비율 '!B:B, 총연구비기준!C7)","v":1}]
["    - 검색결과 : ",{"$f":"\"소속기관명 검색결과 \" & IF(L7 = 1, \"간접비가 \" & TEXT($J$7, \"0.0#%\") & \"로 설정되었습니다.\", L7&\"개 기관이 검색되었습니다. 간접비율 시트에서 기관명을 확인하고 기재하시기 바랍니다.\")","v":"소속기관명 검색결과 간접비가 14.96%로 설정되었습니다."}]
[]
["3. 연구기간 :",null,5,"(연구기간 검증 : ",null,{"$f":"IF(E4=\"\",\"사업 미선택\",IF(C10=\"\",\"연구기간 미선택\",IF(AND(INT(C10)>=INT(J5), INT(C10)<=INT(L5)), \"통과)\", IF(J5 = L5, E4&\"사업은 \" & J5 & \"년만 선택가능합니다)\", E4&\"사업은 \" & J5 & \"년 이상, \" & L5 & \"년 이하를 선택하셔야 합니다)\"))))","v":"통과)"}]
[]
["4. 인건비를 포함한 직접비"]
["  * 위탁과제가 있는 경우만 위탁연구개발비를 기재(간접비 계상시 불포함)",{"$nulls":10},"(단위 : 천원)"]
["구분",null,{"$f":"IF(INT($C$10) >= (COLUMN(C14) - 2), (COLUMN(C14) - 2)&\"차년도\", \"\")","v":"1차년도"},{"$f":"IF(INT($C$10) >= (COLUMN(D14) - 2), (COLUMN(D14) - 2)&\"차년도\", \"\")","v":"2차년도"},{"$f":"IF(INT($C$10) >= (COLUMN(E14) - 2), (COLUMN(E14) - 2)&\"차년도\", \"\")","v":"3차년도"},{"$f":"IF(INT($C$10) >= (COLUMN(F14) - 2), (COLUMN(F14) - 2)&\"차년도\", \"\")","v":"4차년도"},{"$f":"IF(INT($C$10) >= (COLUMN(G14) - 2), (COLUMN(G14) - 2)&\"차년도\", \"\")","v":"5차년도"},{"$f":"IF(INT($C$10) >= (COLUMN(H14) - 2), (COLUMN(H14) - 2)&\"차년도\", \"\")","v":""},"","","",""]
[null,null,{"$f":"IF(INT($C$10) >= (COLUMN(C15) - 2), (COLUMN(C15) + 2014)&\"년\", \"\")","v":"2017년"},{"$f":"IF(INT($C$10) >= (COLUMN(D15) - 2), (COLUMN(D15) + 2014)&\"년\", \"\")","v":"2018년"},"2019년","2020년","2021년","","","","",""]
["위탁연구개발비를 제외한\n총연구비",null,50000,50000,50000,50000,50000]
["위탁연구개발비"]
["오류메시지 : ",null,{"$f":"IF(AND(C14=\"\",C16<>\"\"),\"기입금지\",\"\")","v":""},{"$f":"IF(AND(D14=\"\",D16<>\"\"),\"기입금지\",\"\")","v":""},"","","","","","","",""]
[]
["5. 연구비",{"$nulls":10},"(단위 : 천원)"]
["구분",null,{"$f":"IF(INT($C$10) >= (COLUMN(C21) - 2), (COLUMN(C21) - 2)&\"차년도\", \"\")","v":"1차년도"},{"$f":"IF(INT($C$10) >= (COLUMN(D21) - 2), (COLUMN(D21) - 2)&\"차년도\", \"\")","v":"2차년도"},{"$f":"IF(INT($C$10) >= (COLUMN(E21) - 2), (COLUMN(E21) - 2)&\"차년도\", \"\")","v":"3차년도"},{"$f":"IF(INT($C$10) >= (COLUMN(F21) - 2), (COLUMN(F21) - 2)&\"차년도\", \"\")","v":"4차년도"},{"$f":"IF(INT($C$10) >= (COLUMN(G21) - 2), (COLUMN(G21) - 2)&\"차년도\", \"\")","v":"5차년도"},{"$f":"IF(INT($C$10) >= (COLUMN(H21) - 2), (COLUMN(H21) - 2)&\"차년도\", \"\")","v":""},"","","",""]
[null,null,{"$f":"IF(INT($C$10) >= (COLUMN(C22) - 2), (COLUMN(C22) + 2014)&\"년\", \"\")","v":"2017년"},{"$f":"IF(INT($C$10) >= (COLUMN(D22) - 2), (COLUMN(D22) + 2014)&\"년\", \"\")","v":"2018년"},"2019년","2020년","2021년","","","","",""]
["직접비","현금",{"$f":"IF(INT($C$10) >= (COLUMN(C23) - 2), C16-C26, \"\")","v":43494},{"$f":"IF(INT($C$10) >= (COLUMN(D23) - 2), D16-D26, \"\")","v":43494},43494,43494,43494,{"$f":"IF(INT($C$10) >= (COLUMN(H23) - 2), IF($E$4 = \"리더연구\", ROUNDUP((H16-0.7*$J$7*사업별연구비규모!$B$25)/(1+0.3*$J$7), 0), ROUNDUP(H16/(1+$J$7), 0)), \"\")","v":""},{"$f":"IF(INT($C$10) >= (COLUMN(I23) - 2), IF($E$4 = \"리더연구\", ROUNDUP((I16-0.7*$J$7*사업별연구비규모!$B$25)/(1+0.3*$J$7), 0), ROUNDUP(I16/(1+$J$7), 0)), \"\")","v":""},{"$f":"IF(INT($C$10) >= (COLUMN(J23) - 2), IF($E$4 = \"리더연구\", ROUNDUP((J16-0.7*$J$7*사업별연구비규모!$B$25)/(1+0.3*$J$7), 0), ROUNDUP(J16/(1+$J$7), 0)), \"\")","v":""},{"$f":"IF(INT($C$10) >= (COLUMN(K23) - 2), IF($E$4 = \"리더연구\", ROUNDUP((K16-0.7*$J$7*사업별연구비규모!$B$25)/(1+0.3*$J$7), 0), ROUNDUP(K16/(1+$J$7), 0)), \"\")","v":""},{"$f":"IF(INT($C$10) >= (COLUMN(L23) - 2), IF($E$4 = \"리더연구\", ROUNDUP((L16-0.7*$J$7*사업별연구비규모!$B$25)/(1+0.3*$J$7), 0), ROUNDUP(L16/(1+$J$7), 0)), \"\")","v":""}]
[null,"현물"]
["위탁연구개발비",null,{"$f":"IF(INT($C$10) >= (COLUMN(C25) - 2), ROUNDDOWN(C17, 0), \"\")","v":0},0,0,0,0,"","","","",""]
["간접비","계산금액",{"$f":"IFERROR(ROUNDDOWN((C16/(1/$J$7+1)), 0), \"\")","v":6506},{"$f":"IFERROR(ROUNDDOWN((D16/(1/$J$7+1)), 0), \"\")","v":6506},6506,6506,6506,0,0,0,0,0]
[null,"적용비율",{"$f":"IFERROR(C26/C23, \"\")","v":0.14958385064606614},{"$f":"IFERROR(D26/D23, \"\")","v":0.14958385064606614},0.14958385064606614,0.14958385064606614,0.14958385064606614,"","","","",""]
["연구비 총액",null,{"$f":"IF(INT($C$10)>=(COLUMN(C23)-2),SUM(C16:C17),\"\")","v":50000},50000,50000,50000,50000,"","","","",""]
["오류메시지 : ",null,{"$f":"IF(C28=\"\", \"\", IF(C28<$J$4,\"하한보다 작음\",IF(C28>$L$4,\"상한 초과\",\"\")))","v":""},{"$f":"IF(D28=\"\", \"\", IF(D28<$J$4,\"하한보다 작음\",IF(D28>$L$4,\"상한 초과\",\"\")))","v":""},"","","","","","","",""]
["6. 총연구비 :",{"$f":"SUM(C28:L28)","v":250000},null,"천원","유형 : ",{"$f":"IF(C10>5, IF(C10 < 9, \"유형1\", \"유형2\"), IF(B30<=150000, \"유형1\", IF(B30<=300000, \"유형2\", IF(B30<=500000, \"유형3\", \"유형4\"))))","v":"유형2"}]
[]
["7. 신청가능사업 :",null,{"$f":"IFERROR(IF(AND(B33=\"통과\", B34=\"통과\"), VLOOKUP(E4&F30, 사업별연구비규모!A8:B21, 2, FALSE) & \" 사업에 신청 가능\", \"연구기간 혹은 연구비에 오류가 있어 신청가능한 사업을 표기할 수 없음!\"), \"\")","v":"신진연구(1.5초과~3억이하) 사업에 신청 가능"}]
["  - 연구기간 : ",{"$f":"IF(F10=\"통과)\", \"통과\", \"3. 연구기간 검증 결과 메시지를 확인하세요!\")","v":"통과"}]
["  - 연구비 :",{"$f":"IF(AND(C29=\"\", D29=\"\", E29=\"\", F29=\"\", G29=\"\", H29=\"\", I29=\"\", J29=\"\", K29=\"\", L29=\"\"), \"통과\", \"5. 연구비 테이블 하단의 오류 메시지를 확인하세요\")","v":"통과"}]

{"sheet":"간접비율 ","index":2,"n_rows":647,"n_cols":4,"rows_kept":647,"cut":false,"hidden":false,"merged":[[0,0,0,3],[1,0,1,3]]}
["연구사업통합지원시스템 내 간접비 비율 등록 정보"]
["* 기관명에 (재), ㈜, 재단법인, 주식회사 등은 제거하였으니 순수 기관명으로 확인하시기 바랍니다.\n(주)시온텍->\"시온텍\"으로 검색\n주식회사 넥스바이오->\"넥스바이오\"로 검색\n사단법인 건설기술정책연구원 -> \"건설기술정책연구원\"으로 검색"]
["고시연도","기관명","간접비 \n비율","고시여부"]
[2015,"가천대학교",26.8,"고시기관"]
[2015,"가톨릭관동대학교",29.9,"고시기관"]
[2015,"가톨릭대학교",29.8,"고시기관"]
[2015,"강릉원주대학교",29.5,"고시기관"]
[2015,"강원대학교",27.71,"고시기관"]
[2015,"건국대학교",25.38,"고시기관"]
[2015,"건양대학교",29,"고시기관"]
[2015,"경기과학기술대학교",24.9,"고시기관"]
[2015,"경기대학교",27.25,"고시기관"]
[2015,"경남과학기술대학교",28,"고시기관"]
[2015,"경남대학교",30,"고시기관"]
[2015,"경북대학교",29.6,"고시기관"]
[2015,"경상대학교",30.7,"고시기관"]
[2015,"경성대학교",26.9,"고시기관"]
[2015,"경운대학교",26,"고시기관"]
[2015,"경인교육대학교",29,"고시기관"]
[2015,"경일대학교",29.9,"고시기관"]
[2015,"경희대학교",27.22,"고시기관"]
[2015,"경희사이버대학교",10.82,"고시기관"]
[2015,"계명대학교",31,"고시기관"]
[2015,"고등기술연구원",20.62,"고시기관"]
[2015,"고려대학교",29.5,"고시기관"]
[2015,"고신대학교",23.77,"고시기관"]
[2015,"공주교육대학교",29,"고시기관"]
[2015,"공주대학교",28,"고시기관"]
[2015,"광운대학교",27.9,"고시기관"]
[2015,"광주과학기술원",23.98,"고시기관"]
[2015,"광주교육대학교",20.100000000000001,"고시기관"]
[2015,"광주대학교",27,"고시기관"]
[2015,"광주여자대학교",29,"고시기관"]
[2015,"국가보안기술연구소",39.950000000000003,"고시기관"]
[2015,"국가핵융합연구소",25.36,"고시기관"]
[2015,"국민대학교",29,"고시기관"]
[2015,"국제뇌교육종합대학원대학교",13.44,"고시기관"]
[2015,"군산대학교",22.86,"고시기관"]
[2015,"극동대학교",26.9,"고시기관"]
[2015,"금강대학교",27,"고시기관"]
[2015,"금오공과대학교",25.2,"고시기관"]
[2015,"나사렛대학교",28,"고시기관"]
[2015,"남부대학교",21.83,"고시기관"]
[2015,"남서울대학교",19.170000000000002,"고시기관"]
[2015,"다이텍 (DYETEC) 연구원",21.25,"고시기관"]
[2015,"단국대학교",28,"고시기관"]
[2015,"대구가톨릭대학교",30,"고시기관"]
[2015,"대구경북과학기술원",28.87,"고시기관"]
[2015,"대구교육대학교",22.53,"고시기관"]
[2015,"대구대학교",29,"고시기관"]
[2015,"대구한의대학교",28,"고시기관"]
[2015,"대림대학교",25.77,"고시기관"]
[2015,"대전대학교",29,"고시기관"]
[2015,"대진대학교",29,"고시기관"]
[2015,"대한전기협회",10.28,"고시기관"]
[2015,"덕성여자대학교",28,"고시기관"]
[2015,"동국대학교",28,"고시기관"]
[2015,"동덕여자대학교",20.94,"고시기관"]
[2015,"동명대학교",28,"고시기관"]
[2015,"동서대학교",29,"고시기관"]
[2015,"동신대학교",20.59,"고시기관"]
[2015,"동아대학교",30,"고시기관"]
[2015,"동양대학교",23.23,"고시기관"]
[2015,"동양미래대학교",20.23,"고시기관"]
[2015,"동의대학교",30,"고시기관"]
[2015,"명지대학교",24.58,"고시기관"]
[2015,"명지전문대학",23.88,"고시기관"]
[2015,"목원대학교",27,"고시기관"]
[2015,"목포대학교",25.25,"고시기관"]
[2015,"목포해양대학교",19.350000000000001,"고시기관"]
[2015,"배재대학교",29,"고시기관"]
[2015,"백석대학교",27,"고시기관"]
[2015,"백석문화대학교",21.54,"고시기관"]
[2015,"부경대학교",29,"고시기관"]
[2015,"부산가톨릭대학교",28,"고시기관"]
[2015,"부산대학교",27.4,"고시기관"]
[2015,"부산외국어대학교",28,"고시기관"]
[2015,"부천대학교",10.09,"고시기관"]
[2015,"북한대학원대학교",10.76,"고시기관"]
[2015,"삼성서울병원",20.52,"고시기관"]
[2015,"삼육대학교",27,"고시기관"]
[2015,"상명대학교",29,"고시기관"]
[2015,"상지대학교",26,"고시기관"]
[2015,"서강대학교",26.87,"고시기관"]
[2015,"서경대학교",20.239999999999998,"고시기관"]
[2015,"서울과학기술대학교",29.9,"고시기관"]
[2015,"서울교육대학교",31,"고시기관"]
[2015,"서울대학교",29.5,"고시기관"]
[2015,"서울시립대학교",17.96,"고시기관"]
[2015,"서울여자대학교",30,"고시기관"]
[2015,"서원대학교",26.27,"고시기관"]
[2015,"서일대학교",18.829999999999998,"고시기관"]
[2015,"선문대학교",26.44,"고시기관"]
[2015,"성공회대학교",27,"고시기관"]
[2015,"성균관대학교",30,"고시기관"]
[2015,"성신여자대학교",27,"고시기관"]
[2015,"세명대학교",22.21,"고시기관"]
[2015,"세종대학교",27,"고시기관"]
[2015,"세한대학교",29,"고시기관"]
[2015,"수원대학교",30,"고시기관"]
[2015,"수원여자대학교",20.29,"고시기관"]
[2015,"숙명여자대학교",31,"고시기관"]
[2015,"순천대학교",20.190000000000001,"고시기관"]
[2015,"순천향대학교",23.41,"고시기관"]
[2015,"숭실대학교",28.7,"고시기관"]
[2015,"숭실사이버대학교",24.76,"고시기관"]
[2015,"신라대학교",27,"고시기관"]
[2015,"아주대학교",29.5,"고시기관"]
[2015,"안동대학교",26.42,"고시기관"]
[2015,"안양대학교",20.83,"고시기관"]
[2015,"연세대학교",27.28,"고시기관"]
[2015,"영남대학교",29,"고시기관"]
[2015,"영산대학교",27,"고시기관"]
[2015,"용인대학교",28,"고시기관"]
[2015,"우석대학교",27.9,"고시기관"]
[2015,"울산과학기술원",31,"고시기관"]
[2015,"울산과학대학교",26,"고시기관"]
[2015,"울산대학교",28.7,"고시기관"]
[2015,"원광대학교",29,"고시기관"]
[2015,"위덕대학교",26,"고시기관"]
[2015,"을지대학교",16.38,"고시기관"]
[2015,"이화여자대학교",28.7,"고시기관"]
[2015,"인덕대학교",27,"고시기관"]
[2015,"인제대학교",28.8,"고시기관"]
[2015,"인천대학교",30,"고시기관"]
[2015,"인하공업전문대학",17.45,"고시기관"]
[2015,"인하대학교",30,"고시기관"]
[2015,"자동차부품연구원",22.58,"고시기관"]
[2015,"한국파스퇴르연구소",32.729999999999997,"고시기관"]
[2015,"전남과학대학교",21.99,"고시기관"]
[2015,"전남대학교",30,"고시기관"]
[2015,"전북대학교",28.7,"고시기관"]
[2015,"전자부품연구원",25.44,"고시기관"]
[2015,"전주교육대학교",29,"고시기관"]
[2015,"전주대학교",27,"고시기관"]
[2015,"제주대학교",28.07,"고시기관"]
[2015,"제주한라대학교",26,"고시기관"]
[2015,"조선대학교",29.9,"고시기관"]
[2015,"중소조선연구원",16.829999999999998,"고시기관"]
[2015,"중앙대학교",24.16,"고시기관"]
[2015,"중원대학교",27,"고시기관"]
[2015,"진주교육대학교",26,"고시기관"]
[2015,"차의과학대학교",22.91,"고시기관"]
[2015,"창원대학교",28.9,"고시기관"]
[2015,"청운대학교",27,"고시기관"]
[2015,"청주교육대학교",27,"고시기관"]
[2015,"청주대학교",20.55,"고시기관"]
[2015,"춘천교육대학교",27,"고시기관"]
[2015,"충남대학교",23.82,"고시기관"]
[2015,"충북대학교",27.9,"고시기관"]
[2015,"평택대학교",30,"고시기관"]
[2015,"포항공과대학교",29,"고시기관"]
[2015,"포항산업과학연구원",24.09,"고시기관"]
[2015,"한경대학교",19,"고시기관"]
[2015,"한국건설기술연구원",19.649999999999999,"고시기관"]
[2015,"한국건설생활환경연구원",18.57,"고시기관"]
[2015,"한국과학기술기획평가원",21.62,"고시기관"]
[2015,"한국과학기술연구원",16.72,"고시기관"]
[2015,"한국과학기술원",26.42,"고시기관"]
[2015,"한국과학기술정보연구원",13.14,"고시기관"]
[2015,"한국광기술원",20.79,"고시기관"]
[2015,"한국교원대학교",27,"고시기관"]
[2015,"한국교통대학교",28.36,"고시기관"]
[2015,"한국국제대학교",20.260000000000002,"고시기관"]
[2015,"한국기계연구원",13.48,"고시기관"]
[2015,"한국기계연구원부설 재료연구소",8.6999999999999993,"고시기관"]
[2015,"한국기술교육대학교",24.43,"고시기관"]
[2015,"한국기초과학지원연구원",8.19,"고시기관"]
[2015,"한국농수산대학",3,"고시기관"]
[2015,"한국니트산업연구원",18.510000000000002,"고시기관"]
[2015,"한국로봇융합연구원",21.19,"고시기관"]
[2015,"한국방송통신대학교",27,"고시기관"]
[2015,"한국산업기술대학교",23.83,"고시기관"]
[2015,"한국산업기술시험원",20.16,"고시기관"]
[2015,"한국산업기술진흥원",28.28,"고시기관"]
[2015,"한국생명공학연구원",15.06,"고시기관"]
[2015,"한국생산기술연구원",12.67,"고시기관"]
[2015,"한국선급(사단법인)",35,"고시기관"]
[2015,"한국섬유개발연구원",16.96,"고시기관"]
[2015,"한국섬유기계연구원",21.03,"고시기관"]
[2015,"한국성서대학교",15.66,"고시기관"]
[2015,"한국세라믹기술원",21.02,"고시기관"]
[2015,"한국식품연구원",10.34,"고시기관"]
[2015,"한국식품연구원부설 세계김치연구소",21.71,"고시기관"]
[2015,"한국신발피혁연구원",22.77,"고시기관"]
[2015,"한국실크연구원",13.73,"고시기관"]
[2015,"한국에너지기술연구원",16.43,"고시기관"]
[2015,"한국연구재단",14.96,"고시기관"]
[2015,"한국예술종합학교",27,"고시기관"]
[2015,"한국외국어대학교",27,"고시기관"]
[2015,"한국원자력안전기술원",35.47,"고시기관"]
[2015,"한국원자력연구원",19.489999999999998,"고시기관"]
[2015,"한국원자력의학원",35.96,"고시기관"]
[2015,"한국원자력통제기술원",26.83,"고시기관"]
[2015,"한국전기연구원",13.34,"고시기관"]
[2015,"한국전력국제원자력대학원대학교",29,"고시기관"]
[2015,"한국전자통신연구원",25.55,"고시기관"]
[2015,"한국조선해양기자재연구원(한국조선기자재연구원)",19.14,"고시기관"]
[2015,"한국지질자원연구원",15.75,"고시기관"]
[2015,"한국천문연구원",45.42,"고시기관"]
[2015,"한국철도기술연구원",13.83,"고시기관"]
[2015,"한국체육대학교",29,"고시기관"]
[2015,"한국패션산업연구원",20.53,"고시기관"]
[2015,"한국표준과학연구원",11.8,"고시기관"]
[2015,"한국한의학연구원",31.46,"고시기관"]
[2015,"한국항공대학교",29,"고시기관"]
[2015,"한국항공우주연구원",7.35,"고시기관"]
[2015,"한국해양과학기술원",21.52,"고시기관"]
[2015,"한국해양과학기술원 부설 극지연구소",29.01,"고시기관"]
[2015,"한국해양대학교",27,"고시기관"]
[2015,"한국화학연구원",19.27,"고시기관"]
[2015,"한국화학연구원부설 안전성평가연구소",17.989999999999998,"고시기관"]
[2015,"한남대학교",27.35,"고시기관"]
[2015,"한동대학교",23.24,"고시기관"]
[2015,"한라대학교",28.9,"고시기관"]
[2015,"한림국제대학원대학교",18.420000000000002,"고시기관"]
[2015,"한림대학교",26.92,"고시기관"]
[2015,"한림성심대학교",22.7,"고시기관"]
[2015,"한밭대학교",29,"고시기관"]
[2015,"한서대학교",25.77,"고시기관"]
[2015,"한신대학교",28,"고시기관"]
[2015,"한양대학교",28.42,"고시기관"]
[2015,"한양사이버대학교",10.59,"고시기관"]
[2015,"한양여자대학교",28,"고시기관"]
[2015,"한일장신대학교",22.84,"고시기관"]
[2015,"협성대학교",27,"고시기관"]
[2015,"호남대학교",28,"고시기관"]
[2015,"호서대학교",25.13,"고시기관"]
[2015,"홍익대학교",28,"고시기관"]
[2015,"가톨릭대학교(성신교정)",29.8,"고시기관(캠퍼스)"]
[2015,"가톨릭대학교(성의교정)",29.8,"고시기관(캠퍼스)"]
[2015,"강원대학교(삼척캠퍼스)",27.71,"고시기관(캠퍼스)"]
[2015,"건국대학교 GLOCAL(글로컬)캠퍼스",25.38,"고시기관(캠퍼스)"]
[2015,"경기대학교(서울)",27.25,"고시기관(캠퍼스)"]
[2015,"경북대학교(의,치대)",29.6,"고시기관(캠퍼스)"]
[2015,"경북대학교상주캠퍼스",29.6,"고시기관(캠퍼스)"]
[2015,"경상대학교(칠암)",30.7,"고시기관(캠퍼스)"]
[2015,"경상대학교(통영)",30.7,"고시기관(캠퍼스)"]
[2015,"경희대학교(국제캠퍼스)",27.22,"고시기관(캠퍼스)"]
[2015,"계명대학교(대명)",31,"고시기관(캠퍼스)"]
[2015,"계명대학교(동산동)",31,"고시기관(캠퍼스)"]
[2015,"고려대학교세종캠퍼스",29.5,"고시기관(캠퍼스)"]
[2015,"공주대학교(예산)",28,"고시기관(캠퍼스)"]
[2015,"공주대학교(천안공과대학)",28,"고시기관(캠퍼스)"]
[2015,"군산대학교(소룡)",22.86,"고시기관(캠퍼스)"]
[2015,"단국대학교(천안캠퍼스)",28,"고시기관(캠퍼스)"]
[2015,"대구가톨릭대학교(대명동캠퍼스)",30,"고시기관(캠퍼스)"]
[2015,"대구대학교(제2캠퍼스)",29,"고시기관(캠퍼스)"]
[2015,"동국대학교(경주캠퍼스)",28,"고시기관(캠퍼스)"]
[2015,"동아대학교(구덕)",30,"고시기관(캠퍼스)"]
[2015,"명지대학교(서울캠퍼스)",24.58,"고시기관(캠퍼스)"]
[2015,"부경대학교(제2캠퍼스)",29,"고시기관(캠퍼스)"]
[2015,"부산대학교(밀양캠퍼스)",27.4,"고시기관(캠퍼스)"]
[2015,"부산대학교(의대)",27.4,"고시기관(캠퍼스)"]
[2015,"상명대학교(천안캠퍼스)",29,"고시기관(캠퍼스)"]
[2015,"서울대학교(수원캠퍼스)",29.5,"고시기관(캠퍼스)"]
[2015,"서울대학교(연건캠퍼스)",29.5,"고시기관(캠퍼스)"]
[2015,"서울대학교(평창캠퍼스)",29.5,"고시기관(캠퍼스)"]
[2015,"성균관대학교(자연과학캠퍼스)",30,"고시기관(캠퍼스)"]
[2015,"순천향대학교(천안)",23.41,"고시기관(캠퍼스)"]
[2015,"연세대학교(원주의대)",27.28,"고시기관(캠퍼스)"]
[2015,"연세대학교(원주캠퍼스)",27.28,"고시기관(캠퍼스)"]
[2015,"영남대학교(대명)",29,"고시기관(캠퍼스)"]
[2015,"영산대학교(부산캠퍼스)",27,"고시기관(캠퍼스)"]
[2015,"울산대학교(의대)",28.7,"고시기관(캠퍼스)"]
[2015,"을지대학교(성남캠퍼스)",16.38,"고시기관(캠퍼스)"]
[2015,"이화여자대학교(목동)",28.7,"고시기관(캠퍼스)"]
[2015,"인제대학교(의대)",28.8,"고시기관(캠퍼스)"]
[2015,"전남대학교 여수캠퍼스",30,"고시기관(캠퍼스)"]
[2015,"전남대학교(학동)",30,"고시기관(캠퍼스)"]
[2015,"전북대학교 익산캠퍼스",28.7,"고시기관(캠퍼스)"]
[2015,"제주대학교(사라캠퍼스)",28.07,"고시기관(캠퍼스)"]
[2015,"중앙대학교(안성캠퍼스)",24.16,"고시기관(캠퍼스)"]
[2015,"청운대학교 인천캠퍼스",27,"고시기관(캠퍼스)"]
[2015,"충남대학교(의대)",23.82,"고시기관(캠퍼스)"]
[2015,"한국과학기술원(서울)",26.42,"고시기관(캠퍼스)"]
[2015,"한국외국어대학교(용인캠퍼스)",27,"고시기관(캠퍼스)"]
[2015,"한양대학교(ERICA캠퍼스)",28.42,"고시기관(캠퍼스)"]
[2015,"홍익대학교(세종캠퍼스)",28,"고시기관(캠퍼스)"]
[2015,"길의료재단",17,"미고시기관"]
[2015,"S. F. C",5,"미고시기관"]
[2015,"극동통신",5,"미고시기관"]
[2015,"두시텍",5,"미고시기관"]
[2015,"디스트릭트홀딩스",5,"미고시기관"]
[2015,"레오플",5,"미고시기관"]
[2015,"루키스",5,"미고시기관"]
[2015,"메디칼엑셀런스",10,"미고시기관"]
[2015,"바이오팜솔루션즈",5,"미고시기관"]
[2015,"비츠로테크",5,"미고시기관"]
[2015,"삼우종합건축사사무소",5,"미고시기관"]
[2015,"세스코",5,"미고시기관"]
[2015,"셀리버리",5,"미고시기관"]
[2015,"애드바이오텍",5,"미고시기관"]
[2015,"와이브레인",5,"미고시기관"]
[2015,"울텍",5,"미고시기관"]
[2015,"유라스텍",10,"미고시기관"]
[2015,"유텔",5,"미고시기관"]
[2015,"이룸바이오테크놀러지",5,"미고시기관"]
[2015,"제욱",5,"미고시기관"]
[2015,"지멕스",5,"미고시기관"]
[2015,"푸른이앤알",10,"미고시기관"]
[2015,"퓨전소프트",10,"미고시기관"]
[2015,"함소아제약",5,"미고시기관"]
[2015,"해양수산정책기술연구소",10,"미고시기관"]
[2015,"호서펩티드",5,"미고시기관"]
[2015,"기술과가치",10,"미고시기관"]
[2015,"날리지웍스",10,"미고시기관"]
[2015,"넥스지오",10,"미고시기관"]
[2015,"다음기술단",5,"미고시기관"]
[2015,"대덕바이오",5,"미고시기관"]
[2015,"대웅제약",5,"미고시기관"]
[2015,"대홍기업",5,"미고시기관"]
[2015,"디엔에이링크",5,"미고시기관"]
[2015,"레고켐 바이오사이언스",5,"미고시기관"]
[2015,"로고스바이오시스템스",5,"미고시기관"]
[2015,"메디컬그룹 베스티안",5,"미고시기관"]
[2015,"메디프론디비티",5,"미고시기관"]
[2015,"바이로메드",5,"미고시기관"]
[2015,"바이오알파 성남지점",5,"미고시기관"]
[2015,"바이오에프디엔씨",5,"미고시기관"]
[2015,"비에네스소프트",10,"미고시기관"]
[2015,"세포바이오",10,"미고시기관"]
[2015,"시온텍",5,"미고시기관"]
[2015,"쎄트렉아이",10,"미고시기관"]
[2015,"아이라이트",5,"미고시기관"]
[2015,"에빅스젠",5,"미고시기관"]
[2015,"에스엔피제네틱스",5,"미고시기관"]
[2015,"에스엘에스",5,"미고시기관"]
[2015,"에스이랩",10,"미고시기관"]
[2015,"에프티랩",5,"미고시기관"]
[2015,"오스코텍",10,"미고시기관"]
[2015,"유아이티",10,"미고시기관"]
[2015,"이큐스앤자루 신약개발연구소",5,"미고시기관"]
[2015,"인스페이스",10,"미고시기관"]
[2015,"인실리코젠",10,"미고시기관"]
[2015,"제넥신",5,"미고시기관"]
[2015,"제노스",5,"미고시기관"]
[2015,"져스텍",5,"미고시기관"]
[2015,"카이노스메드",5,"미고시기관"]
[2015,"케이엔알",5,"미고시기관"]
[2015,"쿠보텍",5,"미고시기관"]
[2015,"테라젠이텍스",5,"미고시기관"]
[2015,"테크노베이션파트너스",10,"미고시기관"]
[2015,"퓨쳐켐",5,"미고시기관"]
[2015,"한맥기술",5,"미고시기관"]
[2015,"감리교신학대학교",3,"미고시기관"]
[2015,"강남대학교",3,"미고시기관"]
[2015,"강동경희대학교병원",17,"미고시기관"]
[2015,"강동성심병원",17,"미고시기관"]
[2015,"강릉과학산업진흥원",17,"미고시기관"]
[2015,"강릉아산병원",17,"미고시기관"]
[2015,"강원대학교병원",17,"미고시기관"]
[2015,"개신대학원대학교",3,"미고시기관"]
[2015,"거제대학교",3,"미고시기관"]
[2015,"경남테크노파크",17,"미고시기관"]
[2015,"경동대학교",3,"미고시기관"]
[2015,"경민대학교",3,"미고시기관"]
[2015,"경복대학교",3,"미고시기관"]
[2015,"경북대학교병원",17,"미고시기관"]
[2015,"경북아이티융합산업기술원",17,"미고시기관"]
[2015,"경인여자대학교",3,"미고시기관"]
[2015,"경주대학교",3,"미고시기관"]
[2015,"경찰대학",3,"미고시기관"]
[2015,"경희의료원",17,"미고시기관"]
[2015,"계명대학교동산의료원",17,"미고시기관"]
[2015,"계명문화대학교",3,"미고시기관"]
[2015,"계원예술대학교",3,"미고시기관"]
[2015,"고등과학원(한국과학기술원부설)",17,"미고시기관"]
[2015,"고려대기환경연구소",17,"미고시기관"]
[2015,"고려사이버대학교",3,"미고시기관"]
[2015,"공항시설관리주식회사",5,"미고시기관"]
[2015,"과학기술연합대학원대학교",3,"미고시기관"]
[2015,"과학기술정책연구원",17,"미고시기관"]
[2015,"광주과학기술교류협력센터",17,"미고시기관"]
[2015,"광주보건대학교",3,"미고시기관"]
[2015,"교육시설재난공제회",17,"미고시기관"]
[2015,"구미전자정보기술원",17,"미고시기관"]
[2015,"국가과학기술인력개발원",17,"미고시기관"]
[2015,"국가수리과학연구소",17,"미고시기관"]
[2015,"국경없는 과학기술자회",17,"미고시기관"]
[2015,"국군의학연구소",17,"미고시기관"]
[2015,"국립생태원",17,"미고시기관"]
[2015,"국립서울병원",17,"미고시기관"]
[2015,"국립암센터",17,"미고시기관"]
[2015,"국립중앙과학관",17,"미고시기관"]
[2015,"국립중앙의료원",17,"미고시기관"]
[2015,"국민건강보험공단 일산병원",17,"미고시기관"]
[2015,"국방대학교",3,"미고시기관"]
[2015,"국사편찬위원회",17,"미고시기관"]
[2015,"국제백신연구소(IVI)",17,"미고시기관"]
[2015,"그리스도대학교",3,"미고시기관"]
[2015,"글로벌원자력전략연구소",17,"미고시기관"]
[2015,"기초과학연구원",17,"미고시기관"]
[2015,"김천대학교",3,"미고시기관"]
[2015,"김포대학교",3,"미고시기관"]
[2015,"나노기술연구협의회",17,"미고시기관"]
[2015,"나노종합기술원",17,"미고시기관"]
[2015,"녹색삶지식경제연구원",17,"미고시기관"]
[2015,"농협중앙회식품연구원",17,"미고시기관"]
[2015,"능인불교대학원대학교",3,"미고시기관"]
{"$rows_left_out":248}
{"sheet":"사업별연구비규모","index":3,"n_rows":25,"n_cols":9,"rows_kept":25,"cut":false,"hidden":false,"merged":[]}
["구분","연구비하한","연구비상한","연구기간하한","연구기간상한","간접비",null,null,"연구기간"]
["신진연구",50000,100000,1,5,null,null,null,1]
["중견연구",50000,300000,1,5,null,null,null,2]
[{"$nulls":8},3]
[{"$nulls":8},4]
[{"$nulls":8},5]
["구분","사업유형"]
["이공학개인기초연구(기본)유형1","기본연구(6~8년)"]
["이공학개인기초연구(기본)유형2","기본연구(9~10년)"]
["이공학개인기초연구(보호)유형1","보호연구(6~8년)"]
["이공학개인기초연구(보호)유형2","보호연구(9~10년)"]
["이공학개인기초연구(지역)유형1","지역대학(6~8년)"]
["이공학개인기초연구(지역)유형2","지역대학(9~10년)"]
["신진연구유형1","신진연구(0.5~1.5억이하)"]
["신진연구유형2","신진연구(1.5초과~3억이하)"]
["신진연구유형3","신진연구(3억초과~5억미만)"]
["중견연구유형1","중견연구(0.5~1.5억이하)"]
["중견연구유형2","중견연구(1.5초과~3억이하)"]
["중견연구유형3","중견연구(3억초과~5억이하)"]
["중견연구유형4","중견연구(5억초과~15억이하)"]
["리더연구유형4","리더연구"]
[]
[]
[]
["간접비30% 경계 금액",200000]